Information card for entry 7247329
Formula | C33 H39 Mn3 N15 O13 |
Calculated formula | C33 H39 Mn3 N15 O13 |
Title of publication | Solvent effect on the structures of three manganese complexes based on azotetrazole-3-hydroxy-2-naphthoic acid: synthesis, structures, and magnetic and fluorescent properties |
Authors of publication | Zhong, Yun-Jing; Ouyang, Zhi-Jian; Kuang, Xiao-Man; Li, You-Hong; Chen, Wen-Bin; Yang, Meng; Dong, Wen |
Journal of publication | CrystEngComm |
Year of publication | 2023 |
Journal volume | 25 |
Journal issue | 39 |
Pages of publication | 5524 - 5532 |
a | 21.7912 ± 0.0013 Å |
b | 20.2706 ± 0.0013 Å |
c | 10.2341 ± 0.0006 Å |
α | 90° |
β | 102.939 ± 0.002° |
γ | 90° |
Cell volume | 4405.8 ± 0.5 Å3 |
Cell temperature | 120 ± 2 K |
Ambient diffraction temperature | 120.02 K |
Number of distinct elements | 5 |
Space group number | 15 |
Hermann-Mauguin space group symbol | C 1 2/c 1 |
Hall space group symbol | -C 2yc |
Residual factor for all reflections | 0.0898 |
Residual factor for significantly intense reflections | 0.0546 |
Weighted residual factors for significantly intense reflections | 0.1495 |
Weighted residual factors for all reflections included in the refinement | 0.1674 |
Goodness-of-fit parameter for all reflections included in the refinement | 1.049 |
Diffraction radiation wavelength | 0.71073 Å |
Diffraction radiation type | MoKα |