Information card for entry 7247330
Formula | C28 H28 Mn2 N12 O10 |
Calculated formula | C28 H28 Mn2 N12 O10 |
Title of publication | Solvent effect on the structures of three manganese complexes based on azotetrazole-3-hydroxy-2-naphthoic acid: synthesis, structures, and magnetic and fluorescent properties |
Authors of publication | Zhong, Yun-Jing; Ouyang, Zhi-Jian; Kuang, Xiao-Man; Li, You-Hong; Chen, Wen-Bin; Yang, Meng; Dong, Wen |
Journal of publication | CrystEngComm |
Year of publication | 2023 |
Journal volume | 25 |
Journal issue | 39 |
Pages of publication | 5524 - 5532 |
a | 10.7765 ± 0.0009 Å |
b | 13.3012 ± 0.0011 Å |
c | 11.2337 ± 0.001 Å |
α | 90° |
β | 98.472 ± 0.003° |
γ | 90° |
Cell volume | 1592.7 ± 0.2 Å3 |
Cell temperature | 100 ± 2 K |
Ambient diffraction temperature | 100 K |
Number of distinct elements | 5 |
Space group number | 14 |
Hermann-Mauguin space group symbol | P 1 21/c 1 |
Hall space group symbol | -P 2ybc |
Residual factor for all reflections | 0.056 |
Residual factor for significantly intense reflections | 0.0368 |
Weighted residual factors for significantly intense reflections | 0.1207 |
Weighted residual factors for all reflections included in the refinement | 0.1359 |
Goodness-of-fit parameter for all reflections included in the refinement | 1.026 |
Diffraction radiation wavelength | 0.71073 Å |
Diffraction radiation type | MoKα |