Information card for entry 7247333
Formula | C6 H16 Cu N6 O12 |
Calculated formula | C6 H16 Cu N6 O12 |
Title of publication | Design, preparation, and combustion performance of energetic catalysts based on transition metal ions (Cu2+, Co2+, Fe2+) and 3-aminofurazan-4-carboxylic acid |
Authors of publication | Liu, Wei; Xu, Yuangang; Zhang, Yulong; Zheng, Hanyue; Gou, Xiaodong; Xiao, Fei |
Journal of publication | RSC Advances |
Year of publication | 2023 |
Journal volume | 13 |
Journal issue | 38 |
Pages of publication | 26563 - 26573 |
a | 6.4481 ± 0.001 Å |
b | 17.558 ± 0.003 Å |
c | 6.5592 ± 0.001 Å |
α | 90° |
β | 94.045 ± 0.004° |
γ | 90° |
Cell volume | 740.8 ± 0.2 Å3 |
Cell temperature | 170 K |
Ambient diffraction temperature | 170 K |
Number of distinct elements | 5 |
Space group number | 14 |
Hermann-Mauguin space group symbol | P 1 21/n 1 |
Hall space group symbol | -P 2yn |
Residual factor for all reflections | 0.0822 |
Residual factor for significantly intense reflections | 0.0752 |
Weighted residual factors for significantly intense reflections | 0.1997 |
Weighted residual factors for all reflections included in the refinement | 0.2061 |
Goodness-of-fit parameter for all reflections included in the refinement | 1.194 |
Diffraction radiation wavelength | 0.71073 Å |
Diffraction radiation type | MoKα |