Information card for entry 7247334
Formula | C6 H16 Co N6 O12 |
Calculated formula | C6 H16 Co N6 O12 |
Title of publication | Design, preparation, and combustion performance of energetic catalysts based on transition metal ions (Cu2+, Co2+, Fe2+) and 3-aminofurazan-4-carboxylic acid |
Authors of publication | Liu, Wei; Xu, Yuangang; Zhang, Yulong; Zheng, Hanyue; Gou, Xiaodong; Xiao, Fei |
Journal of publication | RSC Advances |
Year of publication | 2023 |
Journal volume | 13 |
Journal issue | 38 |
Pages of publication | 26563 - 26573 |
a | 6.4342 ± 0.0007 Å |
b | 17.7202 ± 0.0019 Å |
c | 6.537 ± 0.0007 Å |
α | 90° |
β | 90° |
γ | 90° |
Cell volume | 745.32 ± 0.14 Å3 |
Cell temperature | 293 ± 2 K |
Ambient diffraction temperature | 293 ± 2 K |
Number of distinct elements | 5 |
Space group number | 58 |
Hermann-Mauguin space group symbol | P n n m |
Hall space group symbol | -P 2 2n |
Residual factor for all reflections | 0.0386 |
Residual factor for significantly intense reflections | 0.0376 |
Weighted residual factors for significantly intense reflections | 0.1019 |
Weighted residual factors for all reflections included in the refinement | 0.104 |
Goodness-of-fit parameter for all reflections included in the refinement | 1.028 |
Diffraction radiation wavelength | 0.71073 Å |
Diffraction radiation type | MoKα |