Information card for entry 7247419
Formula | C50 H64 Dy2 Mo N22 O18 |
Calculated formula | C50 H64 Dy2 Mo N22 O18 |
Title of publication | Dinuclear and trinuclear cyano-bridged {DyIIIMIV} (M = W, Mo) single-ion magnets supported by pentadentate Schiff-base ligands |
Authors of publication | Mao, Pan-Dong; Sun, Hui-Ying; Yan, Fei-Fei; Zhang, Shi-Hui; Li, Xin-Feng; Zhou, Ren-He; Zhang, Yi-Quan; Meng, Yin-Shan; Liu, Tao |
Journal of publication | CrystEngComm |
Year of publication | 2023 |
Journal volume | 25 |
Journal issue | 43 |
Pages of publication | 6030 - 6038 |
a | 26.9939 ± 0.0009 Å |
b | 9.5351 ± 0.0003 Å |
c | 24.0996 ± 0.0007 Å |
α | 90° |
β | 93.714 ± 0.003° |
γ | 90° |
Cell volume | 6190 ± 0.3 Å3 |
Cell temperature | 120 ± 0.1 K |
Ambient diffraction temperature | 120.15 K |
Number of distinct elements | 6 |
Space group number | 15 |
Hermann-Mauguin space group symbol | C 1 2/c 1 |
Hall space group symbol | -C 2yc |
Residual factor for all reflections | 0.0705 |
Residual factor for significantly intense reflections | 0.0426 |
Weighted residual factors for significantly intense reflections | 0.0964 |
Weighted residual factors for all reflections included in the refinement | 0.1 |
Goodness-of-fit parameter for all reflections included in the refinement | 0.866 |
Diffraction radiation wavelength | 0.71073 Å |
Diffraction radiation type | MoKα |