Information card for entry 7247420
Formula | C31 H39 Dy Mo N15 O16.5 |
Calculated formula | C31 H39 Dy Mo N15 O16.5 |
Title of publication | Dinuclear and trinuclear cyano-bridged {DyIIIMIV} (M = W, Mo) single-ion magnets supported by pentadentate Schiff-base ligands |
Authors of publication | Mao, Pan-Dong; Sun, Hui-Ying; Yan, Fei-Fei; Zhang, Shi-Hui; Li, Xin-Feng; Zhou, Ren-He; Zhang, Yi-Quan; Meng, Yin-Shan; Liu, Tao |
Journal of publication | CrystEngComm |
Year of publication | 2023 |
Journal volume | 25 |
Journal issue | 43 |
Pages of publication | 6030 - 6038 |
a | 10.5532 ± 0.0009 Å |
b | 11.6027 ± 0.001 Å |
c | 18.7684 ± 0.0016 Å |
α | 92.524 ± 0.002° |
β | 95.871 ± 0.002° |
γ | 108.109 ± 0.002° |
Cell volume | 2165.8 ± 0.3 Å3 |
Cell temperature | 120 K |
Ambient diffraction temperature | 120 K |
Number of distinct elements | 6 |
Space group number | 2 |
Hermann-Mauguin space group symbol | P -1 |
Hall space group symbol | -P 1 |
Residual factor for all reflections | 0.0461 |
Residual factor for significantly intense reflections | 0.0365 |
Weighted residual factors for significantly intense reflections | 0.0818 |
Weighted residual factors for all reflections included in the refinement | 0.087 |
Goodness-of-fit parameter for all reflections included in the refinement | 1.046 |
Diffraction radiation wavelength | 0.71073 Å |
Diffraction radiation type | MoKα |