Information card for entry 7247421
Formula | C29 H48 Dy N15 O16.5 W |
Calculated formula | C29 H48 Dy N15 O16.5 W |
Title of publication | Dinuclear and trinuclear cyano-bridged {DyIIIMIV} (M = W, Mo) single-ion magnets supported by pentadentate Schiff-base ligands |
Authors of publication | Mao, Pan-Dong; Sun, Hui-Ying; Yan, Fei-Fei; Zhang, Shi-Hui; Li, Xin-Feng; Zhou, Ren-He; Zhang, Yi-Quan; Meng, Yin-Shan; Liu, Tao |
Journal of publication | CrystEngComm |
Year of publication | 2023 |
Journal volume | 25 |
Journal issue | 43 |
Pages of publication | 6030 - 6038 |
a | 10.4246 ± 0.0011 Å |
b | 11.7295 ± 0.0011 Å |
c | 18.732 ± 0.0019 Å |
α | 93.031 ± 0.003° |
β | 95.698 ± 0.003° |
γ | 108.135 ± 0.003° |
Cell volume | 2157.4 ± 0.4 Å3 |
Cell temperature | 120 K |
Ambient diffraction temperature | 120 K |
Number of distinct elements | 6 |
Space group number | 2 |
Hermann-Mauguin space group symbol | P -1 |
Hall space group symbol | -P 1 |
Residual factor for all reflections | 0.0488 |
Residual factor for significantly intense reflections | 0.0378 |
Weighted residual factors for significantly intense reflections | 0.08 |
Weighted residual factors for all reflections included in the refinement | 0.0847 |
Goodness-of-fit parameter for all reflections included in the refinement | 1.081 |
Diffraction radiation wavelength | 0.71073 Å |
Diffraction radiation type | MoKα |