Information card for entry 7247451
Formula | C18 H12 Cl2 N2 O |
Calculated formula | C18 H12 Cl2 N2 O |
SMILES | c1(cc(cc(c1)Cl)Cl)O.c1ccc2ccc3cccnc3c2n1 |
Title of publication | Dichlorosubstitution as a steering tool in hydrogen bonded cocrystals: the nature of rigid and flexible coformers in crystal structures |
Authors of publication | Dubey, Ritesh; Singh, Sandeep |
Journal of publication | CrystEngComm |
Year of publication | 2023 |
Journal volume | 25 |
Journal issue | 40 |
Pages of publication | 5697 - 5705 |
a | 3.8427 ± 0.0006 Å |
b | 17.047 ± 0.003 Å |
c | 11.6457 ± 0.0018 Å |
α | 90° |
β | 97.752 ± 0.007° |
γ | 90° |
Cell volume | 755.9 ± 0.2 Å3 |
Cell temperature | 150 ± 2 K |
Ambient diffraction temperature | 150 ± 2 K |
Number of distinct elements | 5 |
Space group number | 4 |
Hermann-Mauguin space group symbol | P 1 21 1 |
Hall space group symbol | P 2yb |
Residual factor for all reflections | 0.0535 |
Residual factor for significantly intense reflections | 0.0418 |
Weighted residual factors for significantly intense reflections | 0.0736 |
Weighted residual factors for all reflections included in the refinement | 0.0769 |
Goodness-of-fit parameter for all reflections included in the refinement | 1.03 |
Diffraction radiation wavelength | 0.71073 Å |
Diffraction radiation type | MoKα |