Information card for entry 7247452
Formula | C24 H16 Cl4 N2 O2 |
Calculated formula | C24 H16 Cl4 N2 O2 |
SMILES | c1(c(ccc(c1)Cl)Cl)O.c1(c(ccc(c1)Cl)Cl)O.c1ccc2ccc3cccnc3c2n1 |
Title of publication | Dichlorosubstitution as a steering tool in hydrogen bonded cocrystals: the nature of rigid and flexible coformers in crystal structures |
Authors of publication | Dubey, Ritesh; Singh, Sandeep |
Journal of publication | CrystEngComm |
Year of publication | 2023 |
Journal volume | 25 |
Journal issue | 40 |
Pages of publication | 5697 - 5705 |
a | 7.9894 ± 0.0016 Å |
b | 9.4955 ± 0.0019 Å |
c | 15.762 ± 0.003 Å |
α | 85.572 ± 0.006° |
β | 79.226 ± 0.006° |
γ | 71.653 ± 0.005° |
Cell volume | 1114.8 ± 0.4 Å3 |
Cell temperature | 150 ± 2 K |
Ambient diffraction temperature | 150 ± 2 K |
Number of distinct elements | 5 |
Space group number | 2 |
Hermann-Mauguin space group symbol | P -1 |
Hall space group symbol | -P 1 |
Residual factor for all reflections | 0.1219 |
Residual factor for significantly intense reflections | 0.0616 |
Weighted residual factors for significantly intense reflections | 0.1145 |
Weighted residual factors for all reflections included in the refinement | 0.1343 |
Goodness-of-fit parameter for all reflections included in the refinement | 1.019 |
Diffraction radiation wavelength | 0.71073 Å |
Diffraction radiation type | MoKα |