Information card for entry 7247549
Chemical name | 1,1-dimethyl-7-(dihydroxyborono)-2,1,3-benzoxasilaborol-3(1H)-ol |
Formula | C11 H18 B2 O5 Si |
Calculated formula | C11 H18 B2 O5 Si |
Title of publication | Exploring the effect of substitution patterns on the symmetry of hydrogen-bonded supramolecular motifs in functionalized benzosiloxaboroles |
Authors of publication | Durka, Krzysztof; Zuba, Adam; Marek-Urban, Paulina H.; Nowicki, Krzysztof; Drapała, Jakub; Woźniak, Krzysztof; Luliński, Sergiusz |
Journal of publication | CrystEngComm |
Year of publication | 2023 |
Journal volume | 25 |
Journal issue | 45 |
Pages of publication | 6329 - 6342 |
a | 7.0678 ± 0.0002 Å |
b | 16.2162 ± 0.0003 Å |
c | 12.8481 ± 0.0003 Å |
α | 90° |
β | 97.58 ± 0.002° |
γ | 90° |
Cell volume | 1459.69 ± 0.06 Å3 |
Cell temperature | 100 ± 2 K |
Ambient diffraction temperature | 100 ± 2 K |
Number of distinct elements | 5 |
Space group number | 14 |
Hermann-Mauguin space group symbol | P 1 21/c 1 |
Hall space group symbol | -P 2ybc |
Residual factor for all reflections | 0.0676 |
Residual factor for significantly intense reflections | 0.0438 |
Weighted residual factors for significantly intense reflections | 0.1094 |
Weighted residual factors for all reflections included in the refinement | 0.124 |
Goodness-of-fit parameter for all reflections included in the refinement | 1.055 |
Diffraction radiation probe | x-ray |
Diffraction radiation wavelength | 0.71073 Å |
Diffraction radiation type | MoKα |