Information card for entry 7247550
Chemical name | 6-bromo-1,1-dimethyl-2,1,3-benzoxasilaborol-3(1H)-ol |
Formula | C8 H10 B Br O2 Si |
Calculated formula | C8 H10 B Br O2 Si |
Title of publication | Exploring the effect of substitution patterns on the symmetry of hydrogen-bonded supramolecular motifs in functionalized benzosiloxaboroles |
Authors of publication | Durka, Krzysztof; Zuba, Adam; Marek-Urban, Paulina H.; Nowicki, Krzysztof; Drapała, Jakub; Woźniak, Krzysztof; Luliński, Sergiusz |
Journal of publication | CrystEngComm |
Year of publication | 2023 |
Journal volume | 25 |
Journal issue | 45 |
Pages of publication | 6329 - 6342 |
a | 15.6371 ± 0.0001 Å |
b | 15.6371 ± 0.0001 Å |
c | 17.646 ± 0.0002 Å |
α | 90° |
β | 90° |
γ | 90° |
Cell volume | 4314.78 ± 0.06 Å3 |
Cell temperature | 100 ± 2 K |
Ambient diffraction temperature | 100 ± 2 K |
Number of distinct elements | 6 |
Space group number | 88 |
Hermann-Mauguin space group symbol | I 41/a :2 |
Hall space group symbol | -I 4ad |
Residual factor for all reflections | 0.0371 |
Residual factor for significantly intense reflections | 0.0239 |
Weighted residual factors for significantly intense reflections | 0.0533 |
Weighted residual factors for all reflections included in the refinement | 0.0583 |
Goodness-of-fit parameter for all reflections included in the refinement | 1.046 |
Diffraction radiation probe | x-ray |
Diffraction radiation wavelength | 0.71073 Å |
Diffraction radiation type | MoKα |