Information card for entry 7247551
Chemical name | 1,1-dimethyl-7-chloro-3-hydroxybenzo[c][1,2,3]siloxaborole |
Formula | C8 H10 B Cl O2 Si |
Calculated formula | C8 H10 B Cl O2 Si |
Title of publication | Exploring the effect of substitution patterns on the symmetry of hydrogen-bonded supramolecular motifs in functionalized benzosiloxaboroles |
Authors of publication | Durka, Krzysztof; Zuba, Adam; Marek-Urban, Paulina H.; Nowicki, Krzysztof; Drapała, Jakub; Woźniak, Krzysztof; Luliński, Sergiusz |
Journal of publication | CrystEngComm |
Year of publication | 2023 |
Journal volume | 25 |
Journal issue | 45 |
Pages of publication | 6329 - 6342 |
a | 15.507 ± 0.0001 Å |
b | 15.507 ± 0.0001 Å |
c | 17.3326 ± 0.0002 Å |
α | 90° |
β | 90° |
γ | 90° |
Cell volume | 4167.92 ± 0.06 Å3 |
Cell temperature | 100 ± 2 K |
Ambient diffraction temperature | 100 ± 2 K |
Number of distinct elements | 6 |
Space group number | 88 |
Hermann-Mauguin space group symbol | I 41/a :2 |
Hall space group symbol | -I 4ad |
Residual factor for all reflections | 0.0307 |
Residual factor for significantly intense reflections | 0.0304 |
Weighted residual factors for significantly intense reflections | 0.0865 |
Weighted residual factors for all reflections included in the refinement | 0.0868 |
Goodness-of-fit parameter for all reflections included in the refinement | 1.095 |
Diffraction radiation wavelength | 1.54178 Å |
Diffraction radiation type | CuKα |