Information card for entry 7247632
Formula | C20 H20 Br3 P Pb |
Calculated formula | C20 H20 Br3 P Pb |
Title of publication | Regulating the crystal and electronic structures and optical properties of hybrid bromoplumbates with alkylated N, S- or P-containing aromatic cations |
Authors of publication | Gao, Cheng-Cheng; Tang, Xue-Na; Miao, Jing-Ling; Li, Yu; Li, Cuncheng; Liu, Guang-Ning |
Journal of publication | CrystEngComm |
Year of publication | 2023 |
Journal volume | 25 |
Journal issue | 47 |
Pages of publication | 6556 - 6567 |
a | 22.297 ± 0.0012 Å |
b | 7.948 ± 0.0004 Å |
c | 25.2706 ± 0.0011 Å |
α | 90° |
β | 90° |
γ | 90° |
Cell volume | 4478.4 ± 0.4 Å3 |
Cell temperature | 293 ± 2 K |
Ambient diffraction temperature | 293 ± 2 K |
Number of distinct elements | 5 |
Space group number | 61 |
Hermann-Mauguin space group symbol | P b c a |
Hall space group symbol | -P 2ac 2ab |
Residual factor for all reflections | 0.1182 |
Residual factor for significantly intense reflections | 0.0499 |
Weighted residual factors for significantly intense reflections | 0.0769 |
Weighted residual factors for all reflections included in the refinement | 0.1022 |
Goodness-of-fit parameter for all reflections included in the refinement | 0.996 |
Diffraction radiation probe | x-ray |
Diffraction radiation wavelength | 0.71073 Å |
Diffraction radiation type | MoKα |