Information card for entry 7247633
Formula | C20 H24 Br8 N2 Pb3 S2 |
Calculated formula | C20 H24 Br8 N2 Pb3 S2 |
Title of publication | Regulating the crystal and electronic structures and optical properties of hybrid bromoplumbates with alkylated N, S- or P-containing aromatic cations |
Authors of publication | Gao, Cheng-Cheng; Tang, Xue-Na; Miao, Jing-Ling; Li, Yu; Li, Cuncheng; Liu, Guang-Ning |
Journal of publication | CrystEngComm |
Year of publication | 2023 |
Journal volume | 25 |
Journal issue | 47 |
Pages of publication | 6556 - 6567 |
a | 8.8791 ± 0.0004 Å |
b | 21.8322 ± 0.0014 Å |
c | 17.9977 ± 0.001 Å |
α | 90° |
β | 91.913 ± 0.005° |
γ | 90° |
Cell volume | 3486.9 ± 0.3 Å3 |
Cell temperature | 293 ± 2 K |
Ambient diffraction temperature | 293 ± 2 K |
Number of distinct elements | 6 |
Space group number | 14 |
Hermann-Mauguin space group symbol | P 1 21/c 1 |
Hall space group symbol | -P 2ybc |
Residual factor for all reflections | 0.1354 |
Residual factor for significantly intense reflections | 0.0707 |
Weighted residual factors for significantly intense reflections | 0.1343 |
Weighted residual factors for all reflections included in the refinement | 0.1591 |
Goodness-of-fit parameter for all reflections included in the refinement | 0.88 |
Diffraction radiation probe | x-ray |
Diffraction radiation wavelength | 0.71073 Å |
Diffraction radiation type | MoKα |