Information card for entry 7247644
Chemical name | Cytidine and silver nitrate |
Formula | C9 H13 Ag N4 O8 |
Calculated formula | C9 H13 Ag N4 O8 |
Title of publication | A linear CH±-NO3− base pair motif promoted by AgNO3 mediated proton transfer between guanosine and cytidine |
Authors of publication | Wu, Qiong; Chai, Yingying; Huang, Ridong; Chen, Hai; He, Yang |
Journal of publication | CrystEngComm |
Year of publication | 2023 |
Journal volume | 25 |
Journal issue | 47 |
Pages of publication | 6549 - 6555 |
a | 4.6969 ± 0.0003 Å |
b | 15.1122 ± 0.0011 Å |
c | 17.3305 ± 0.0012 Å |
α | 90° |
β | 90° |
γ | 90° |
Cell volume | 1230.13 ± 0.15 Å3 |
Cell temperature | 100 K |
Ambient diffraction temperature | 100 K |
Number of distinct elements | 5 |
Space group number | 19 |
Hermann-Mauguin space group symbol | P 21 21 21 |
Hall space group symbol | P 2ac 2ab |
Residual factor for all reflections | 0.0372 |
Residual factor for significantly intense reflections | 0.0358 |
Weighted residual factors for significantly intense reflections | 0.1124 |
Weighted residual factors for all reflections included in the refinement | 0.1146 |
Goodness-of-fit parameter for all reflections included in the refinement | 1.162 |
Diffraction radiation wavelength | 0.72929 Å |
Diffraction radiation type | synchrotron |