Information card for entry 7247645
Formula | C24 H38 Co F6 N4 O6 |
Calculated formula | C24 H38 Co F6 N4 O6 |
Title of publication | Alternating [ML2(MeOH)2] and [ML2(EtOH)2] layers in low-temperature ferromagnets [ML2(MeOH)2][ML2(EtOH)2] (M = CoII, NiII or CoII0.5NiII0.5) |
Authors of publication | Ovcharenko, Victor; Fursova, Elena; Letyagin, Gleb; Morozov, Vitaly; Bogomyakov, Artem; Romanenko, Galina |
Journal of publication | CrystEngComm |
Year of publication | 2023 |
Journal volume | 25 |
Journal issue | 44 |
Pages of publication | 6194 - 6203 |
a | 10.0114 ± 0.0003 Å |
b | 16.1179 ± 0.0005 Å |
c | 11.3898 ± 0.0004 Å |
α | 90° |
β | 120.466 ± 0.002° |
γ | 90° |
Cell volume | 1584.13 ± 0.09 Å3 |
Cell temperature | 296 ± 2 K |
Ambient diffraction temperature | 296 ± 2 K |
Number of distinct elements | 6 |
Space group number | 14 |
Hermann-Mauguin space group symbol | P 1 21/c 1 |
Hall space group symbol | -P 2ybc |
Residual factor for all reflections | 0.0705 |
Residual factor for significantly intense reflections | 0.0384 |
Weighted residual factors for significantly intense reflections | 0.0787 |
Weighted residual factors for all reflections included in the refinement | 0.0856 |
Goodness-of-fit parameter for all reflections included in the refinement | 0.922 |
Diffraction radiation wavelength | 0.71073 Å |
Diffraction radiation type | MoKα |