Information card for entry 7247648
Formula | C23 H36 Co0.5 F6 N4 Ni0.5 O6 |
Calculated formula | C23 H36 Co0.5 F6 N4 Ni0.5 O6 |
Title of publication | Alternating [ML2(MeOH)2] and [ML2(EtOH)2] layers in low-temperature ferromagnets [ML2(MeOH)2][ML2(EtOH)2] (M = CoII, NiII or CoII0.5NiII0.5) |
Authors of publication | Ovcharenko, Victor; Fursova, Elena; Letyagin, Gleb; Morozov, Vitaly; Bogomyakov, Artem; Romanenko, Galina |
Journal of publication | CrystEngComm |
Year of publication | 2023 |
Journal volume | 25 |
Journal issue | 44 |
Pages of publication | 6194 - 6203 |
a | 18.333 ± 0.004 Å |
b | 15.836 ± 0.003 Å |
c | 11.701 ± 0.002 Å |
α | 90° |
β | 120.036 ± 0.008° |
γ | 90° |
Cell volume | 2940.9 ± 1 Å3 |
Cell temperature | 296 ± 2 K |
Ambient diffraction temperature | 296 ± 2 K |
Number of distinct elements | 7 |
Space group number | 14 |
Hermann-Mauguin space group symbol | P 1 21/c 1 |
Hall space group symbol | -P 2ybc |
Residual factor for all reflections | 0.1951 |
Residual factor for significantly intense reflections | 0.0592 |
Weighted residual factors for significantly intense reflections | 0.1539 |
Weighted residual factors for all reflections included in the refinement | 0.1958 |
Goodness-of-fit parameter for all reflections included in the refinement | 0.837 |
Diffraction radiation wavelength | 0.71073 Å |
Diffraction radiation type | MoKα |