Information card for entry 7247647
Formula | C22 H34 F6 N4 Ni O6 |
Calculated formula | C22 H34 F6 N4 Ni O6 |
Title of publication | Alternating [ML2(MeOH)2] and [ML2(EtOH)2] layers in low-temperature ferromagnets [ML2(MeOH)2][ML2(EtOH)2] (M = CoII, NiII or CoII0.5NiII0.5) |
Authors of publication | Ovcharenko, Victor; Fursova, Elena; Letyagin, Gleb; Morozov, Vitaly; Bogomyakov, Artem; Romanenko, Galina |
Journal of publication | CrystEngComm |
Year of publication | 2023 |
Journal volume | 25 |
Journal issue | 44 |
Pages of publication | 6194 - 6203 |
a | 8.9504 ± 0.0011 Å |
b | 15.8017 ± 0.0018 Å |
c | 11.5358 ± 0.0017 Å |
α | 90° |
β | 118.8 ± 0.004° |
γ | 90° |
Cell volume | 1429.7 ± 0.3 Å3 |
Cell temperature | 296 ± 2 K |
Ambient diffraction temperature | 296 ± 2 K |
Number of distinct elements | 6 |
Space group number | 14 |
Hermann-Mauguin space group symbol | P 1 21/c 1 |
Hall space group symbol | -P 2ybc |
Residual factor for all reflections | 0.033 |
Residual factor for significantly intense reflections | 0.032 |
Weighted residual factors for significantly intense reflections | 0.0903 |
Weighted residual factors for all reflections included in the refinement | 0.0915 |
Goodness-of-fit parameter for all reflections included in the refinement | 1.032 |
Diffraction radiation wavelength | 1.54178 Å |
Diffraction radiation type | CuKα |