Information card for entry 7247718
Formula | C32 H32 Cl6 N4 O11 S3 |
Calculated formula | C32 H32 Cl6 N4 O11 S3 |
Title of publication | Development of new multicomponent crystals of the antifungal drug tioconazole and the assessment of their biopharmaceutical attributes |
Authors of publication | Madhesiya, Avinash; Dash, Sibananda G.; Gupta, Princi; Akhir, Abdul; Saxena, Deepanshi; Maitra, Rahul; Chopra, Sidharth; Thakur, Tejender S. |
Journal of publication | CrystEngComm |
Year of publication | 2023 |
Journal volume | 25 |
Journal issue | 48 |
Pages of publication | 6758 - 6776 |
a | 8.4631 ± 0.0003 Å |
b | 12.0147 ± 0.0006 Å |
c | 21.5955 ± 0.0018 Å |
α | 82.36 ± 0.009° |
β | 88.44 ± 0.006° |
γ | 88.592 ± 0.003° |
Cell volume | 2175.1 ± 0.2 Å3 |
Cell temperature | 297 ± 2 K |
Ambient diffraction temperature | 297 ± 2 K |
Number of distinct elements | 6 |
Space group number | 2 |
Hermann-Mauguin space group symbol | P -1 |
Hall space group symbol | -P 1 |
Residual factor for all reflections | 0.1016 |
Residual factor for significantly intense reflections | 0.086 |
Weighted residual factors for significantly intense reflections | 0.2464 |
Weighted residual factors for all reflections included in the refinement | 0.2716 |
Goodness-of-fit parameter for all reflections included in the refinement | 1.095 |
Diffraction radiation wavelength | 1.54184 Å |
Diffraction radiation type | CuKα |