Information card for entry 7247719
Common name | Tioconazole-L-tartrate 1:1 salt hydrate |
Formula | C20 H25 Cl3 N2 O10.42 S |
Calculated formula | C20 H25 Cl3 N2 O10.42 S |
Title of publication | Development of new multicomponent crystals of the antifungal drug tioconazole and the assessment of their biopharmaceutical attributes |
Authors of publication | Madhesiya, Avinash; Dash, Sibananda G.; Gupta, Princi; Akhir, Abdul; Saxena, Deepanshi; Maitra, Rahul; Chopra, Sidharth; Thakur, Tejender S. |
Journal of publication | CrystEngComm |
Year of publication | 2023 |
Journal volume | 25 |
Journal issue | 48 |
Pages of publication | 6758 - 6776 |
a | 7.6028 ± 0.0001 Å |
b | 9.9444 ± 0.0001 Å |
c | 35.6016 ± 0.0004 Å |
α | 90° |
β | 90° |
γ | 90° |
Cell volume | 2691.67 ± 0.05 Å3 |
Cell temperature | 293 ± 2 K |
Ambient diffraction temperature | 293 ± 2 K |
Number of distinct elements | 6 |
Space group number | 19 |
Hermann-Mauguin space group symbol | P 21 21 21 |
Hall space group symbol | P 2ac 2ab |
Residual factor for all reflections | 0.0641 |
Residual factor for significantly intense reflections | 0.0618 |
Weighted residual factors for significantly intense reflections | 0.1301 |
Weighted residual factors for all reflections included in the refinement | 0.1312 |
Goodness-of-fit parameter for all reflections included in the refinement | 1.146 |
Diffraction radiation wavelength | 1.54184 Å |
Diffraction radiation type | CuKα |