Information card for entry 7247720
Common name | Tioconzaole sulfate (2:1) salt heptahydrate |
Formula | C32 H42 Cl6 N4 O13 S3 |
Calculated formula | C32 H42 Cl6 N4 O13 S3 |
Title of publication | Development of new multicomponent crystals of the antifungal drug tioconazole and the assessment of their biopharmaceutical attributes |
Authors of publication | Madhesiya, Avinash; Dash, Sibananda G.; Gupta, Princi; Akhir, Abdul; Saxena, Deepanshi; Maitra, Rahul; Chopra, Sidharth; Thakur, Tejender S. |
Journal of publication | CrystEngComm |
Year of publication | 2023 |
Journal volume | 25 |
Journal issue | 48 |
Pages of publication | 6758 - 6776 |
a | 10.5568 ± 0.0003 Å |
b | 10.9083 ± 0.0003 Å |
c | 20.8988 ± 0.0004 Å |
α | 86.078 ± 0.002° |
β | 77.368 ± 0.002° |
γ | 66.24 ± 0.003° |
Cell volume | 2148.81 ± 0.11 Å3 |
Cell temperature | 100 ± 2 K |
Ambient diffraction temperature | 100 ± 2 K |
Number of distinct elements | 6 |
Space group number | 1 |
Hermann-Mauguin space group symbol | P 1 |
Hall space group symbol | P 1 |
Residual factor for all reflections | 0.0773 |
Residual factor for significantly intense reflections | 0.0677 |
Weighted residual factors for significantly intense reflections | 0.1937 |
Weighted residual factors for all reflections included in the refinement | 0.206 |
Goodness-of-fit parameter for all reflections included in the refinement | 1.069 |
Diffraction radiation wavelength | 1.54184 Å |
Diffraction radiation type | CuKα |