Information card for entry 7247750
Formula | C30 H18 Mn N4 O4 |
Calculated formula | C30 H18 Mn N4 O4 |
Title of publication | Synthesis, structure, and investigation of unique magnetic properties in two novel Mn-based coordination polymers |
Authors of publication | Li, Duqingcuo; Liu, Yichen; Xiang, Ruifang; Li, Yuyan; Qin, Tianrui; Dong, Xiu Yan; Sakiyama, Hiroshi; Muddassir, Mohd.; Liu, Jianqiang |
Journal of publication | CrystEngComm |
Year of publication | 2023 |
Journal volume | 25 |
Journal issue | 48 |
Pages of publication | 6777 - 6785 |
a | 7.959 ± 0.0006 Å |
b | 10.7872 ± 0.0008 Å |
c | 29.582 ± 0.002 Å |
α | 90° |
β | 93.461 ± 0.004° |
γ | 90° |
Cell volume | 2535.1 ± 0.3 Å3 |
Cell temperature | 193 K |
Ambient diffraction temperature | 193 K |
Number of distinct elements | 5 |
Space group number | 13 |
Hermann-Mauguin space group symbol | P 1 2/n 1 |
Hall space group symbol | -P 2yac |
Residual factor for all reflections | 0.05 |
Residual factor for significantly intense reflections | 0.036 |
Weighted residual factors for significantly intense reflections | 0.0876 |
Weighted residual factors for all reflections included in the refinement | 0.0943 |
Goodness-of-fit parameter for all reflections included in the refinement | 1.032 |
Diffraction radiation wavelength | 1.34139 Å |
Diffraction radiation type | GaKα |