Information card for entry 7247751
Formula | C24 H17 Mn N4 O5 |
Calculated formula | C24 H17 Mn N4 O5 |
Title of publication | Synthesis, structure, and investigation of unique magnetic properties in two novel Mn-based coordination polymers |
Authors of publication | Li, Duqingcuo; Liu, Yichen; Xiang, Ruifang; Li, Yuyan; Qin, Tianrui; Dong, Xiu Yan; Sakiyama, Hiroshi; Muddassir, Mohd.; Liu, Jianqiang |
Journal of publication | CrystEngComm |
Year of publication | 2023 |
Journal volume | 25 |
Journal issue | 48 |
Pages of publication | 6777 - 6785 |
a | 9.584 ± 0.0002 Å |
b | 10.552 ± 0.0003 Å |
c | 11.7635 ± 0.0003 Å |
α | 93.832 ± 0.001° |
β | 111.246 ± 0.001° |
γ | 108.96 ± 0.001° |
Cell volume | 1025.39 ± 0.05 Å3 |
Cell temperature | 173 ± 2 K |
Ambient diffraction temperature | 173 K |
Number of distinct elements | 5 |
Space group number | 2 |
Hermann-Mauguin space group symbol | P -1 |
Hall space group symbol | -P 1 |
Residual factor for all reflections | 0.0327 |
Residual factor for significantly intense reflections | 0.0299 |
Weighted residual factors for significantly intense reflections | 0.0763 |
Weighted residual factors for all reflections included in the refinement | 0.0786 |
Goodness-of-fit parameter for all reflections included in the refinement | 1.049 |
Diffraction radiation wavelength | 1.54178 Å |
Diffraction radiation type | CuKα |