Information card for entry 7247814
Formula | C31 H26 Cd2 N4 O11 |
Calculated formula | C31 H26 Cd2 N4 O11 |
Title of publication | Fabrication of 5-R-isophthalic acid-modulated cadmium–organic coordination polymers and selectivity for the efficient detection of multiple analytes |
Authors of publication | Li, Wen-Ze; Sheng, Yu-Shu; Zhang, Xiao-Sa; Liu, Yu; Li, Jing; Luan, Jian |
Journal of publication | CrystEngComm |
Year of publication | 2023 |
Journal volume | 25 |
Journal issue | 43 |
Pages of publication | 6067 - 6079 |
a | 10.3061 ± 0.0001 Å |
b | 8.9312 ± 0.0001 Å |
c | 16.601 ± 0.0003 Å |
α | 90° |
β | 95.428 ± 0.001° |
γ | 90° |
Cell volume | 1521.2 ± 0.04 Å3 |
Cell temperature | 293 ± 2 K |
Ambient diffraction temperature | 293 ± 2 K |
Number of distinct elements | 5 |
Space group number | 13 |
Hermann-Mauguin space group symbol | P 1 2/c 1 |
Hall space group symbol | -P 2yc |
Residual factor for all reflections | 0.0248 |
Residual factor for significantly intense reflections | 0.0234 |
Weighted residual factors for significantly intense reflections | 0.0606 |
Weighted residual factors for all reflections included in the refinement | 0.0613 |
Goodness-of-fit parameter for all reflections included in the refinement | 1.0483 |
Diffraction radiation wavelength | 1.54178 Å |
Diffraction radiation type | CuKα |