Information card for entry 7247815
Formula | C15.5 H18 Cd N2 O8 |
Calculated formula | C15.5 H18 Cd N2 O8 |
Title of publication | Fabrication of 5-R-isophthalic acid-modulated cadmium–organic coordination polymers and selectivity for the efficient detection of multiple analytes |
Authors of publication | Li, Wen-Ze; Sheng, Yu-Shu; Zhang, Xiao-Sa; Liu, Yu; Li, Jing; Luan, Jian |
Journal of publication | CrystEngComm |
Year of publication | 2023 |
Journal volume | 25 |
Journal issue | 43 |
Pages of publication | 6067 - 6079 |
a | 11.0328 ± 0.0001 Å |
b | 17.1307 ± 0.0002 Å |
c | 19.2872 ± 0.0002 Å |
α | 90° |
β | 93.281 ± 0.001° |
γ | 90° |
Cell volume | 3639.3 ± 0.07 Å3 |
Cell temperature | 293 ± 2 K |
Ambient diffraction temperature | 293 ± 2 K |
Number of distinct elements | 5 |
Space group number | 15 |
Hermann-Mauguin space group symbol | C 1 2/c 1 |
Hall space group symbol | -C 2yc |
Residual factor for all reflections | 0.0246 |
Residual factor for significantly intense reflections | 0.0234 |
Weighted residual factors for significantly intense reflections | 0.0629 |
Weighted residual factors for all reflections included in the refinement | 0.0637 |
Goodness-of-fit parameter for all reflections included in the refinement | 1.0708 |
Diffraction radiation wavelength | 1.54178 Å |
Diffraction radiation type | CuKα |