Information card for entry 7247817
Formula | C33 H38 Cd2 N4 O15 |
Calculated formula | C33 H38 Cd2 N4 O15 |
Title of publication | Fabrication of 5-R-isophthalic acid-modulated cadmium–organic coordination polymers and selectivity for the efficient detection of multiple analytes |
Authors of publication | Li, Wen-Ze; Sheng, Yu-Shu; Zhang, Xiao-Sa; Liu, Yu; Li, Jing; Luan, Jian |
Journal of publication | CrystEngComm |
Year of publication | 2023 |
Journal volume | 25 |
Journal issue | 43 |
Pages of publication | 6067 - 6079 |
a | 10.0583 ± 0.0002 Å |
b | 10.1823 ± 0.0002 Å |
c | 20.6673 ± 0.0003 Å |
α | 97.263 ± 0.002° |
β | 94.133 ± 0.001° |
γ | 119.439 ± 0.002° |
Cell volume | 1806.38 ± 0.07 Å3 |
Cell temperature | 293 ± 2 K |
Ambient diffraction temperature | 293 ± 2 K |
Number of distinct elements | 5 |
Space group number | 2 |
Hermann-Mauguin space group symbol | P -1 |
Hall space group symbol | -P 1 |
Residual factor for all reflections | 0.0349 |
Residual factor for significantly intense reflections | 0.033 |
Weighted residual factors for significantly intense reflections | 0.0898 |
Weighted residual factors for all reflections included in the refinement | 0.0924 |
Goodness-of-fit parameter for all reflections included in the refinement | 1.045 |
Diffraction radiation wavelength | 1.54178 Å |
Diffraction radiation type | CuKα |