Information card for entry 7247816
Formula | C23 H23 Cd N4 O8.5 |
Calculated formula | C23 H23 Cd N4 O8.5 |
Title of publication | Fabrication of 5-R-isophthalic acid-modulated cadmium–organic coordination polymers and selectivity for the efficient detection of multiple analytes |
Authors of publication | Li, Wen-Ze; Sheng, Yu-Shu; Zhang, Xiao-Sa; Liu, Yu; Li, Jing; Luan, Jian |
Journal of publication | CrystEngComm |
Year of publication | 2023 |
Journal volume | 25 |
Journal issue | 43 |
Pages of publication | 6067 - 6079 |
a | 27.3243 ± 0.0002 Å |
b | 10.2895 ± 0.0001 Å |
c | 17.8117 ± 0.0002 Å |
α | 90° |
β | 105.53 ± 0.001° |
γ | 90° |
Cell volume | 4824.99 ± 0.08 Å3 |
Cell temperature | 293 ± 2 K |
Ambient diffraction temperature | 293 ± 2 K |
Number of distinct elements | 5 |
Space group number | 15 |
Hermann-Mauguin space group symbol | C 1 2/c 1 |
Hall space group symbol | -C 2yc |
Residual factor for all reflections | 0.0579 |
Residual factor for significantly intense reflections | 0.0576 |
Weighted residual factors for significantly intense reflections | 0.1448 |
Weighted residual factors for all reflections included in the refinement | 0.1449 |
Goodness-of-fit parameter for all reflections included in the refinement | 0.9176 |
Diffraction radiation wavelength | 1.54178 Å |
Diffraction radiation type | CuKα |