Information card for entry 7248276
Formula | C12 H16 Cl6 I2 N2 Te |
Calculated formula | C12 H16 Cl6 I2 N2 Te |
Title of publication | Polymeric polyiodo-chlorotellurates(iv): new supramolecular hybrids in halometalate chemistry |
Authors of publication | Korobeynikov, Nikita A.; Usoltsev, Andrey N.; Sokolov, Maxim N.; Novikov, Alexander S.; Adonin, Sergey A. |
Journal of publication | CrystEngComm |
Year of publication | 2024 |
Journal volume | 26 |
Journal issue | 14 |
Pages of publication | 2018 - 2024 |
a | 13.6493 ± 0.0011 Å |
b | 10.0133 ± 0.0006 Å |
c | 18.0921 ± 0.0014 Å |
α | 90° |
β | 111.399 ± 0.004° |
γ | 90° |
Cell volume | 2302.3 ± 0.3 Å3 |
Cell temperature | 150 ± 2 K |
Ambient diffraction temperature | 150 K |
Number of distinct elements | 6 |
Space group number | 15 |
Hermann-Mauguin space group symbol | C 1 2/c 1 |
Hall space group symbol | -C 2yc |
Residual factor for all reflections | 0.0418 |
Residual factor for significantly intense reflections | 0.0303 |
Weighted residual factors for significantly intense reflections | 0.0546 |
Weighted residual factors for all reflections included in the refinement | 0.0578 |
Goodness-of-fit parameter for all reflections included in the refinement | 1.029 |
Diffraction radiation wavelength | 0.71073 Å |
Diffraction radiation type | MoKα |