Information card for entry 7248277
Formula | C6 H20 Cl6 I2 N2 Te |
Calculated formula | C5.9997 H19.999 Cl6 I2 N1.9999 Te |
Title of publication | Polymeric polyiodo-chlorotellurates(iv): new supramolecular hybrids in halometalate chemistry |
Authors of publication | Korobeynikov, Nikita A.; Usoltsev, Andrey N.; Sokolov, Maxim N.; Novikov, Alexander S.; Adonin, Sergey A. |
Journal of publication | CrystEngComm |
Year of publication | 2024 |
Journal volume | 26 |
Journal issue | 14 |
Pages of publication | 2018 - 2024 |
a | 12.6722 ± 0.0002 Å |
b | 9.9937 ± 0.0002 Å |
c | 17.2207 ± 0.0003 Å |
α | 90° |
β | 102.588 ± 0.001° |
γ | 90° |
Cell volume | 2128.44 ± 0.07 Å3 |
Cell temperature | 150 K |
Ambient diffraction temperature | 150 K |
Number of distinct elements | 6 |
Space group number | 14 |
Hermann-Mauguin space group symbol | P 1 21/c 1 |
Hall space group symbol | -P 2ybc |
Residual factor for all reflections | 0.0398 |
Residual factor for significantly intense reflections | 0.028 |
Weighted residual factors for significantly intense reflections | 0.0549 |
Weighted residual factors for all reflections included in the refinement | 0.0586 |
Goodness-of-fit parameter for all reflections included in the refinement | 1.038 |
Diffraction radiation wavelength | 0.71073 Å |
Diffraction radiation type | MoKα |