Information card for entry 7248278
Formula | C12 H16 Cl6 I2 N2 Te |
Calculated formula | C12 H16 Cl6 I2 N2 Te |
Title of publication | Polymeric polyiodo-chlorotellurates(iv): new supramolecular hybrids in halometalate chemistry |
Authors of publication | Korobeynikov, Nikita A.; Usoltsev, Andrey N.; Sokolov, Maxim N.; Novikov, Alexander S.; Adonin, Sergey A. |
Journal of publication | CrystEngComm |
Year of publication | 2024 |
Journal volume | 26 |
Journal issue | 14 |
Pages of publication | 2018 - 2024 |
a | 17.8598 ± 0.0011 Å |
b | 7.4112 ± 0.0005 Å |
c | 17.6492 ± 0.0011 Å |
α | 90° |
β | 100.334 ± 0.002° |
γ | 90° |
Cell volume | 2298.2 ± 0.3 Å3 |
Cell temperature | 150 ± 2 K |
Ambient diffraction temperature | 150 K |
Number of distinct elements | 6 |
Space group number | 13 |
Hermann-Mauguin space group symbol | P 1 2/c 1 |
Hall space group symbol | -P 2yc |
Residual factor for all reflections | 0.0526 |
Residual factor for significantly intense reflections | 0.0313 |
Weighted residual factors for significantly intense reflections | 0.0498 |
Weighted residual factors for all reflections included in the refinement | 0.055 |
Goodness-of-fit parameter for all reflections included in the refinement | 1.04 |
Diffraction radiation probe | x-ray |
Diffraction radiation wavelength | 0.71073 Å |
Diffraction radiation type | MoKα |