Information card for entry 7248894
Formula | C36 H68 Eu Gd N31 O49 |
Calculated formula | C36 H68 Eu Gd N31 O49 |
Title of publication | Highly tunable emission properties of solid-state supramolecular compounds based on Eu mixed-lanthanide complexes and cucurbit[6]uril |
Authors of publication | Rakhmanova, Mariana; Sukhikh, Taisiya; Kovalenko, Ekaterina |
Journal of publication | CrystEngComm |
Year of publication | 2024 |
Journal volume | 26 |
Journal issue | 29 |
Pages of publication | 3954 - 3963 |
a | 13.4267 ± 0.0003 Å |
b | 14.4721 ± 0.0004 Å |
c | 18.2429 ± 0.0004 Å |
α | 73.8016 ± 0.001° |
β | 87.3486 ± 0.001° |
γ | 87.8007 ± 0.0011° |
Cell volume | 3399.26 ± 0.14 Å3 |
Cell temperature | 150 ± 2 K |
Ambient diffraction temperature | 150 ± 2 K |
Number of distinct elements | 6 |
Space group number | 2 |
Hermann-Mauguin space group symbol | P -1 |
Hall space group symbol | -P 1 |
Residual factor for all reflections | 0.0516 |
Residual factor for significantly intense reflections | 0.0453 |
Weighted residual factors for significantly intense reflections | 0.101 |
Weighted residual factors for all reflections included in the refinement | 0.1035 |
Goodness-of-fit parameter for all reflections included in the refinement | 1.203 |
Diffraction radiation wavelength | 0.71073 Å |
Diffraction radiation type | MoKα |