Information card for entry 7248895
Formula | C36 H68 Dy Eu N31 O49 |
Calculated formula | C36 H68 Dy Eu N31 O49 |
Title of publication | Highly tunable emission properties of solid-state supramolecular compounds based on Eu mixed-lanthanide complexes and cucurbit[6]uril |
Authors of publication | Rakhmanova, Mariana; Sukhikh, Taisiya; Kovalenko, Ekaterina |
Journal of publication | CrystEngComm |
Year of publication | 2024 |
Journal volume | 26 |
Journal issue | 29 |
Pages of publication | 3954 - 3963 |
a | 13.4214 ± 0.0005 Å |
b | 14.4818 ± 0.0006 Å |
c | 18.2079 ± 0.0007 Å |
α | 73.8732 ± 0.0013° |
β | 87.4439 ± 0.0013° |
γ | 87.9242 ± 0.0012° |
Cell volume | 3395.3 ± 0.2 Å3 |
Cell temperature | 150 ± 2 K |
Ambient diffraction temperature | 150 ± 2 K |
Number of distinct elements | 6 |
Space group number | 2 |
Hermann-Mauguin space group symbol | P -1 |
Hall space group symbol | -P 1 |
Residual factor for all reflections | 0.0735 |
Residual factor for significantly intense reflections | 0.0613 |
Weighted residual factors for significantly intense reflections | 0.149 |
Weighted residual factors for all reflections included in the refinement | 0.1558 |
Goodness-of-fit parameter for all reflections included in the refinement | 1.031 |
Diffraction radiation wavelength | 0.71073 Å |
Diffraction radiation type | MoKα |