Information card for entry 7700623
Formula | C32 H42 Cl2 N6 Pd |
Calculated formula | C32 H42 Cl2 N6 Pd |
Title of publication | Synthesis and structural characterization of 20-membered macrocyclic rings bearing trans-chelating bis(N-heterocyclic carbene) ligands and the catalytic activity of their palladium(ii) complexes. |
Authors of publication | Thapa, Rajesh; Kilyanek, Stefan M. |
Journal of publication | Dalton transactions (Cambridge, England : 2003) |
Year of publication | 2019 |
Journal volume | 48 |
Journal issue | 33 |
Pages of publication | 12577 - 12590 |
a | 11.612 ± 0.004 Å |
b | 8.505 ± 0.002 Å |
c | 16.28 ± 0.005 Å |
α | 90° |
β | 94.685 ± 0.004° |
γ | 90° |
Cell volume | 1602.4 ± 0.8 Å3 |
Cell temperature | 100 ± 2 K |
Ambient diffraction temperature | 100 ± 2 K |
Number of distinct elements | 5 |
Space group number | 14 |
Hermann-Mauguin space group symbol | P 1 21/c 1 |
Hall space group symbol | -P 2ybc |
Residual factor for all reflections | 0.1231 |
Residual factor for significantly intense reflections | 0.0751 |
Weighted residual factors for significantly intense reflections | 0.1975 |
Weighted residual factors for all reflections included in the refinement | 0.2326 |
Goodness-of-fit parameter for all reflections included in the refinement | 1.004 |
Diffraction radiation wavelength | 0.71073 Å |
Diffraction radiation type | MoKα |