Information card for entry 7700624
Formula | C65 H86 Ag4 Br4 Cl2 N12 |
Calculated formula | C64 H84 Ag4 Br4 N12 |
Title of publication | Synthesis and structural characterization of 20-membered macrocyclic rings bearing trans-chelating bis(N-heterocyclic carbene) ligands and the catalytic activity of their palladium(ii) complexes. |
Authors of publication | Thapa, Rajesh; Kilyanek, Stefan M. |
Journal of publication | Dalton transactions (Cambridge, England : 2003) |
Year of publication | 2019 |
Journal volume | 48 |
Journal issue | 33 |
Pages of publication | 12577 - 12590 |
a | 9.84 ± 0.004 Å |
b | 22.482 ± 0.008 Å |
c | 15.732 ± 0.006 Å |
α | 90° |
β | 93.172 ± 0.005° |
γ | 90° |
Cell volume | 3475 ± 2 Å3 |
Cell temperature | 100 ± 2 K |
Ambient diffraction temperature | 100 ± 2 K |
Number of distinct elements | 6 |
Space group number | 14 |
Hermann-Mauguin space group symbol | P 1 21/c 1 |
Hall space group symbol | -P 2ybc |
Residual factor for all reflections | 0.0936 |
Residual factor for significantly intense reflections | 0.0579 |
Weighted residual factors for significantly intense reflections | 0.1288 |
Weighted residual factors for all reflections included in the refinement | 0.1415 |
Goodness-of-fit parameter for all reflections included in the refinement | 1.007 |
Diffraction radiation wavelength | 0.71073 Å |
Diffraction radiation type | MoKα |