Information card for entry 7700673
Formula | C32 H23 N |
Calculated formula | C32 H23 N |
Title of publication | Syntheses and quadratic nonlinear optical properties of 2,7-fluorenylene- and 1,4-phenylene-functionalized o-carboranes. |
Authors of publication | Jiang, Peng; Wang, Zhaojin; Moxey, Graeme J.; Morshedi, Mahbod; Barlow, Adam; Wang, Genmiao; Quintana, Cristóbal; Zhang, Chi; Cifuentes, Marie P.; Humphrey, Mark G. |
Journal of publication | Dalton transactions (Cambridge, England : 2003) |
Year of publication | 2019 |
Journal volume | 48 |
Journal issue | 33 |
Pages of publication | 12549 - 12559 |
a | 10.1137 ± 0.0007 Å |
b | 10.5179 ± 0.0006 Å |
c | 24.2285 ± 0.0015 Å |
α | 84.313 ± 0.005° |
β | 82.206 ± 0.005° |
γ | 64.163 ± 0.006° |
Cell volume | 2295.9 ± 0.3 Å3 |
Cell temperature | 150 ± 0.1 K |
Ambient diffraction temperature | 150 ± 0.1 K |
Number of distinct elements | 3 |
Space group number | 2 |
Hermann-Mauguin space group symbol | P -1 |
Hall space group symbol | -P 1 |
Residual factor for all reflections | 0.1005 |
Residual factor for significantly intense reflections | 0.0566 |
Weighted residual factors for significantly intense reflections | 0.1166 |
Weighted residual factors for all reflections included in the refinement | 0.1425 |
Goodness-of-fit parameter for all reflections included in the refinement | 1.05 |
Diffraction radiation probe | x-ray |
Diffraction radiation wavelength | 1.54184 Å |
Diffraction radiation type | CuKα |