Information card for entry 7700674
Formula | C35 H35 N |
Calculated formula | C35 H35 N |
Title of publication | Syntheses and quadratic nonlinear optical properties of 2,7-fluorenylene- and 1,4-phenylene-functionalized o-carboranes. |
Authors of publication | Jiang, Peng; Wang, Zhaojin; Moxey, Graeme J.; Morshedi, Mahbod; Barlow, Adam; Wang, Genmiao; Quintana, Cristóbal; Zhang, Chi; Cifuentes, Marie P.; Humphrey, Mark G. |
Journal of publication | Dalton transactions (Cambridge, England : 2003) |
Year of publication | 2019 |
Journal volume | 48 |
Journal issue | 33 |
Pages of publication | 12549 - 12559 |
a | 11.573 ± 0.0005 Å |
b | 12.1386 ± 0.0005 Å |
c | 12.2843 ± 0.0006 Å |
α | 105.841 ± 0.004° |
β | 108.491 ± 0.004° |
γ | 110.908 ± 0.004° |
Cell volume | 1375.97 ± 0.15 Å3 |
Cell temperature | 150 ± 0.1 K |
Ambient diffraction temperature | 150 ± 0.1 K |
Number of distinct elements | 3 |
Space group number | 2 |
Hermann-Mauguin space group symbol | P -1 |
Hall space group symbol | -P 1 |
Residual factor for all reflections | 0.0498 |
Residual factor for significantly intense reflections | 0.0395 |
Weighted residual factors for significantly intense reflections | 0.0983 |
Weighted residual factors for all reflections included in the refinement | 0.1054 |
Goodness-of-fit parameter for all reflections included in the refinement | 1.029 |
Diffraction radiation probe | x-ray |
Diffraction radiation wavelength | 1.54184 Å |
Diffraction radiation type | CuKα |