Information card for entry 7700685
Formula | C22 H34 Ag Cl N4 |
Calculated formula | C22 H34 Ag Cl N4 |
Title of publication | Cu(i), Ag(i), Ni(ii), Cr(iii) and Ir(i) complexes with tritopic N<sup>imine</sup>C<sup>NHC</sup>N<sup>amine</sup> pincer ligands and catalytic ethylene oligomerization. |
Authors of publication | Ren, Xiaoyu; Wesolek, Marcel; Braunstein, Pierre |
Journal of publication | Dalton transactions (Cambridge, England : 2003) |
Year of publication | 2019 |
Journal volume | 48 |
Journal issue | 34 |
Pages of publication | 12895 - 12909 |
a | 8.4886 ± 0.0008 Å |
b | 19.7601 ± 0.0019 Å |
c | 16.189 ± 0.0012 Å |
α | 90° |
β | 118.595 ± 0.004° |
γ | 90° |
Cell volume | 2384.3 ± 0.4 Å3 |
Cell temperature | 173 ± 2 K |
Ambient diffraction temperature | 173 ± 2 K |
Number of distinct elements | 5 |
Space group number | 14 |
Hermann-Mauguin space group symbol | P 1 21/c 1 |
Hall space group symbol | -P 2ybc |
Residual factor for all reflections | 0.0552 |
Residual factor for significantly intense reflections | 0.0318 |
Weighted residual factors for significantly intense reflections | 0.0643 |
Weighted residual factors for all reflections included in the refinement | 0.0734 |
Goodness-of-fit parameter for all reflections included in the refinement | 1.01 |
Diffraction radiation wavelength | 0.71073 Å |
Diffraction radiation type | MoKα |