Information card for entry 7700690
Formula | C21 H32 Cl3 Cr N4 |
Calculated formula | C21 H32 Cl3 Cr N4 |
Title of publication | Cu(i), Ag(i), Ni(ii), Cr(iii) and Ir(i) complexes with tritopic N<sup>imine</sup>C<sup>NHC</sup>N<sup>amine</sup> pincer ligands and catalytic ethylene oligomerization. |
Authors of publication | Ren, Xiaoyu; Wesolek, Marcel; Braunstein, Pierre |
Journal of publication | Dalton transactions (Cambridge, England : 2003) |
Year of publication | 2019 |
Journal volume | 48 |
Journal issue | 34 |
Pages of publication | 12895 - 12909 |
a | 9.276 ± 0.001 Å |
b | 10.6492 ± 0.0012 Å |
c | 15.4308 ± 0.0017 Å |
α | 94.943 ± 0.002° |
β | 105.109 ± 0.002° |
γ | 96.726 ± 0.002° |
Cell volume | 1450.6 ± 0.3 Å3 |
Cell temperature | 173 ± 2 K |
Ambient diffraction temperature | 173 ± 2 K |
Number of distinct elements | 5 |
Space group number | 2 |
Hermann-Mauguin space group symbol | P -1 |
Hall space group symbol | -P 1 |
Residual factor for all reflections | 0.0978 |
Residual factor for significantly intense reflections | 0.0507 |
Weighted residual factors for significantly intense reflections | 0.1081 |
Weighted residual factors for all reflections included in the refinement | 0.1184 |
Goodness-of-fit parameter for all reflections included in the refinement | 0.961 |
Diffraction radiation wavelength | 0.71073 Å |
Diffraction radiation type | MoKα |