Information card for entry 7700701
Formula | C26 H15 Cl F3 N3 O3 Pt S3 |
Calculated formula | C26 H15 Cl F3 N3 O3 Pt S3 |
Title of publication | Platinum(ii) complexes showing high cytotoxicity toward A2780 ovarian carcinoma cells. |
Authors of publication | Choroba, Katarzyna; Machura, Barbara; Raposo, Luis R.; Małecki, Jan G; Kula, Slawomir; Pająk, Michał; Erfurt, Karol; Maroń, Anna M; Fernandes, Alexandra R. |
Journal of publication | Dalton transactions (Cambridge, England : 2003) |
Year of publication | 2019 |
Journal volume | 48 |
Journal issue | 34 |
Pages of publication | 13081 - 13093 |
a | 11.3288 ± 0.0007 Å |
b | 30.4681 ± 0.0012 Å |
c | 7.9355 ± 0.0004 Å |
α | 90° |
β | 109.536 ± 0.006° |
γ | 90° |
Cell volume | 2581.4 ± 0.2 Å3 |
Cell temperature | 295 ± 2 K |
Ambient diffraction temperature | 295 ± 2 K |
Number of distinct elements | 8 |
Space group number | 14 |
Hermann-Mauguin space group symbol | P 1 21/c 1 |
Hall space group symbol | -P 2ybc |
Residual factor for all reflections | 0.0541 |
Residual factor for significantly intense reflections | 0.0434 |
Weighted residual factors for significantly intense reflections | 0.0993 |
Weighted residual factors for all reflections included in the refinement | 0.1033 |
Goodness-of-fit parameter for all reflections included in the refinement | 1.098 |
Diffraction radiation probe | x-ray |
Diffraction radiation wavelength | 0.71073 Å |
Diffraction radiation type | MoKα |