Information card for entry 7700702
Common name | 4-OH |
Formula | C19 H12 Br Mn N2 O4 |
Calculated formula | C19 H12 Br Mn N2 O4 |
Title of publication | Elucidating the origins of enhanced CO<sub>2</sub> reduction in manganese electrocatalysts bearing pendant hydrogen-bond donors. |
Authors of publication | Tignor, Steven E.; Shaw, Travis W.; Bocarsly, Andrew B. |
Journal of publication | Dalton transactions (Cambridge, England : 2003) |
Year of publication | 2019 |
Journal volume | 48 |
Journal issue | 33 |
Pages of publication | 12730 - 12737 |
a | 14.0073 ± 0.0009 Å |
b | 9.6629 ± 0.0007 Å |
c | 14.7314 ± 0.001 Å |
α | 90° |
β | 117.874 ± 0.002° |
γ | 90° |
Cell volume | 1762.6 ± 0.2 Å3 |
Cell temperature | 100 ± 2 K |
Ambient diffraction temperature | 100 ± 2 K |
Number of distinct elements | 6 |
Space group number | 14 |
Hermann-Mauguin space group symbol | P 1 21/c 1 |
Hall space group symbol | -P 2ybc |
Residual factor for all reflections | 0.0279 |
Residual factor for significantly intense reflections | 0.022 |
Weighted residual factors for significantly intense reflections | 0.0546 |
Weighted residual factors for all reflections included in the refinement | 0.0566 |
Goodness-of-fit parameter for all reflections included in the refinement | 1.053 |
Diffraction radiation wavelength | 0.71073 Å |
Diffraction radiation type | MoKα |