Information card for entry 7700710
Formula | C20 H22 F6 N4 O7 S2 |
Calculated formula | C20 H22 F6 N4 O7 S2 |
Title of publication | Synthesis, characterization and anti-cancer properties of water-soluble bis(PYE) pro-ligands and derived palladium(ii) complexes. |
Authors of publication | Zafar, Muhammad Naveed; Masood, Sara; Chaudhry, Gul-E-Saba; Muhammad, Tengku Sifzizul Tengku; Dalebrook, Andrew Francis; Nazar, Muhammad Faizan; Malik, Fouzia Perveen; Mughal, Ehsan Ullah; Wright, Leonard James |
Journal of publication | Dalton transactions (Cambridge, England : 2003) |
Year of publication | 2019 |
Journal volume | 48 |
Journal issue | 41 |
Pages of publication | 15408 - 15418 |
a | 12.7108 ± 0.0001 Å |
b | 12.4777 ± 0.0001 Å |
c | 16.4443 ± 0.0002 Å |
α | 90° |
β | 98.012 ± 0.001° |
γ | 90° |
Cell volume | 2582.63 ± 0.04 Å3 |
Cell temperature | 88 ± 2 K |
Ambient diffraction temperature | 88 ± 2 K |
Number of distinct elements | 6 |
Space group number | 14 |
Hermann-Mauguin space group symbol | P 1 21/n 1 |
Hall space group symbol | -P 2yn |
Residual factor for all reflections | 0.0432 |
Residual factor for significantly intense reflections | 0.0356 |
Weighted residual factors for significantly intense reflections | 0.0883 |
Weighted residual factors for all reflections included in the refinement | 0.0935 |
Goodness-of-fit parameter for all reflections included in the refinement | 1.051 |
Diffraction radiation wavelength | 0.71073 Å |
Diffraction radiation type | MoKα |