Information card for entry 7700711
Formula | C30 H35.5 F6 N8 O7.5 Pd S2 |
Calculated formula | C30 H35.34 F6 N8 O7.5 Pd S2 |
Title of publication | Synthesis, characterization and anti-cancer properties of water-soluble bis(PYE) pro-ligands and derived palladium(ii) complexes. |
Authors of publication | Zafar, Muhammad Naveed; Masood, Sara; Chaudhry, Gul-E-Saba; Muhammad, Tengku Sifzizul Tengku; Dalebrook, Andrew Francis; Nazar, Muhammad Faizan; Malik, Fouzia Perveen; Mughal, Ehsan Ullah; Wright, Leonard James |
Journal of publication | Dalton transactions (Cambridge, England : 2003) |
Year of publication | 2019 |
Journal volume | 48 |
Journal issue | 41 |
Pages of publication | 15408 - 15418 |
a | 9.609 ± 0.005 Å |
b | 13.66 ± 0.005 Å |
c | 15.003 ± 0.005 Å |
α | 106.473 ± 0.005° |
β | 93.89 ± 0.005° |
γ | 101.967 ± 0.005° |
Cell volume | 1830.5 ± 1.3 Å3 |
Cell temperature | 89 ± 2 K |
Ambient diffraction temperature | 89 ± 2 K |
Number of distinct elements | 7 |
Space group number | 2 |
Hermann-Mauguin space group symbol | P -1 |
Hall space group symbol | -P 1 |
Residual factor for all reflections | 0.0679 |
Residual factor for significantly intense reflections | 0.0492 |
Weighted residual factors for significantly intense reflections | 0.1226 |
Weighted residual factors for all reflections included in the refinement | 0.1349 |
Goodness-of-fit parameter for all reflections included in the refinement | 1.031 |
Diffraction radiation wavelength | 0.71073 Å |
Diffraction radiation type | MoKα |