Information card for entry 7700716
Formula | C35 H51 B2 Br4 N8 Ni |
Calculated formula | C35 H51 B2 Br4 N8 Ni |
Title of publication | Synthesis and characterization of bis(pyrazolyl)borate Ni(ii) complexes: ligand rearrangement and transformation. |
Authors of publication | Zhao, Qianyi; Guan, Xin-Ting; Dou, Ting; Cao, Hou-Ji; Ma, Na-Na; Xu, Ting; Gao, Peng-Hui; Kong, Xiao-Hua; Zhang, Jie; Chen, Xuenian |
Journal of publication | Dalton transactions (Cambridge, England : 2003) |
Year of publication | 2019 |
Journal volume | 48 |
Journal issue | 35 |
Pages of publication | 13242 - 13247 |
a | 11.1521 ± 0.0002 Å |
b | 19.2678 ± 0.0003 Å |
c | 18.7249 ± 0.0002 Å |
α | 90° |
β | 102.221 ± 0.001° |
γ | 90° |
Cell volume | 3932.36 ± 0.1 Å3 |
Cell temperature | 170 ± 0.1 K |
Ambient diffraction temperature | 170 ± 0.1 K |
Number of distinct elements | 6 |
Space group number | 14 |
Hermann-Mauguin space group symbol | P 1 21/n 1 |
Hall space group symbol | -P 2yn |
Residual factor for all reflections | 0.0436 |
Residual factor for significantly intense reflections | 0.0382 |
Weighted residual factors for significantly intense reflections | 0.0923 |
Weighted residual factors for all reflections included in the refinement | 0.0955 |
Goodness-of-fit parameter for all reflections included in the refinement | 1.079 |
Diffraction radiation probe | x-ray |
Diffraction radiation wavelength | 1.54184 Å |
Diffraction radiation type | CuKα |