Information card for entry 7700733
Formula | C26 H50 F3 N3 Ni O3 P2 S |
Calculated formula | C26 H50 F3 N3 Ni O3 P2 S |
Title of publication | Interrogating the steric outcome during H<sub>2</sub> heterolysis: in-plane steric effects in the regioselective protonation of the PN<sup>3</sup>P-pincer ligand. |
Authors of publication | Yao, Changguang; Zhang, Tonghuan; Zhou, Chunhui; Huang, Kuo-Wei |
Journal of publication | Dalton transactions (Cambridge, England : 2003) |
Year of publication | 2019 |
Journal volume | 48 |
Journal issue | 34 |
Pages of publication | 12817 - 12821 |
a | 16.2124 ± 0.0013 Å |
b | 15.9077 ± 0.0014 Å |
c | 26.36 ± 0.002 Å |
α | 90° |
β | 95.74 ± 0.003° |
γ | 90° |
Cell volume | 6764.2 ± 1 Å3 |
Cell temperature | 100 ± 2 K |
Ambient diffraction temperature | 100 ± 2 K |
Number of distinct elements | 8 |
Space group number | 14 |
Hermann-Mauguin space group symbol | P 1 21/c 1 |
Hall space group symbol | -P 2ybc |
Residual factor for all reflections | 0.0529 |
Residual factor for significantly intense reflections | 0.0413 |
Weighted residual factors for significantly intense reflections | 0.1067 |
Weighted residual factors for all reflections included in the refinement | 0.1141 |
Goodness-of-fit parameter for all reflections included in the refinement | 1.035 |
Diffraction radiation wavelength | 0.71073 Å |
Diffraction radiation type | MoKα |