Information card for entry 7700734
Chemical name | Orthorhombic |
Formula | C31 H60 F3 N3 Ni O3 P2 S |
Calculated formula | C31 H60 F3 N3 Ni O3 P2 S |
Title of publication | Interrogating the steric outcome during H<sub>2</sub> heterolysis: in-plane steric effects in the regioselective protonation of the PN<sup>3</sup>P-pincer ligand. |
Authors of publication | Yao, Changguang; Zhang, Tonghuan; Zhou, Chunhui; Huang, Kuo-Wei |
Journal of publication | Dalton transactions (Cambridge, England : 2003) |
Year of publication | 2019 |
Journal volume | 48 |
Journal issue | 34 |
Pages of publication | 12817 - 12821 |
a | 18.9717 ± 0.0011 Å |
b | 16.9554 ± 0.0008 Å |
c | 23.077 ± 0.0013 Å |
α | 90° |
β | 90° |
γ | 90° |
Cell volume | 7423.2 ± 0.7 Å3 |
Cell temperature | 120.01 K |
Ambient diffraction temperature | 120.01 K |
Number of distinct elements | 8 |
Space group number | 61 |
Hermann-Mauguin space group symbol | P b c a |
Hall space group symbol | -P 2ac 2ab |
Residual factor for all reflections | 0.0883 |
Residual factor for significantly intense reflections | 0.0583 |
Weighted residual factors for significantly intense reflections | 0.1518 |
Weighted residual factors for all reflections included in the refinement | 0.1736 |
Goodness-of-fit parameter for all reflections included in the refinement | 1.051 |
Diffraction radiation wavelength | 0.71073 Å |
Diffraction radiation type | MoKα |