Information card for entry 7700760
Common name | [In(N3Dmp2)] |
Formula | C51.5 H54 In0.75 N3 |
Calculated formula | C51.5 H54 In0.75 N3 |
Title of publication | Kinetic stabilization of low-oxidation state and terminal hydrido main group metal complexes by a sterically demanding N,N'-bis(2,6-terphenyl)triazenide. |
Authors of publication | Leverett, Anthony R.; Diachenko, Vera; Cole, Marcus L.; McKay, Alasdair I. |
Journal of publication | Dalton transactions (Cambridge, England : 2003) |
Year of publication | 2019 |
Journal volume | 48 |
Journal issue | 35 |
Pages of publication | 13197 - 13204 |
a | 10.4601 ± 0.0005 Å |
b | 11.394 ± 0.0006 Å |
c | 19.9439 ± 0.0009 Å |
α | 103.975 ± 0.004° |
β | 95.003 ± 0.004° |
γ | 110.046 ± 0.005° |
Cell volume | 2128.9 ± 0.2 Å3 |
Cell temperature | 173 ± 2 K |
Ambient diffraction temperature | 173 K |
Number of distinct elements | 4 |
Space group number | 2 |
Hermann-Mauguin space group symbol | P -1 |
Hall space group symbol | -P 1 |
Residual factor for all reflections | 0.1084 |
Residual factor for significantly intense reflections | 0.0661 |
Weighted residual factors for significantly intense reflections | 0.124 |
Weighted residual factors for all reflections included in the refinement | 0.1421 |
Goodness-of-fit parameter for all reflections included in the refinement | 1.078 |
Diffraction radiation wavelength | 0.71073 Å |
Diffraction radiation type | MoKα |