Information card for entry 7700762
Formula | C138 H106 Ag2 N2 O38 P2 Ti8 |
Calculated formula | C138 H106 Ag2 N2 O38 P2 Ti8 |
Title of publication | A series of silver doped butterfly-like Ti<sub>8</sub>Ag<sub>2</sub> clusters with two Ag ions panelled on a Ti<sub>8</sub> surface. |
Authors of publication | Yu, You-Zhu; Guo, Yao; Zhang, Yan-Ru; Liu, Min-Min; Feng, Ya-Ru; Geng, Cui-Huan; Zhang, Xian-Ming |
Journal of publication | Dalton transactions (Cambridge, England : 2003) |
Year of publication | 2019 |
Journal volume | 48 |
Journal issue | 35 |
Pages of publication | 13423 - 13429 |
a | 14.2611 ± 0.0003 Å |
b | 18.0847 ± 0.0005 Å |
c | 26.3595 ± 0.0008 Å |
α | 90° |
β | 92.723 ± 0.002° |
γ | 90° |
Cell volume | 6790.6 ± 0.3 Å3 |
Cell temperature | 293 ± 2 K |
Ambient diffraction temperature | 293 ± 2 K |
Number of distinct elements | 7 |
Space group number | 14 |
Hermann-Mauguin space group symbol | P 1 21/c 1 |
Hall space group symbol | -P 2ybc |
Residual factor for all reflections | 0.0806 |
Residual factor for significantly intense reflections | 0.0511 |
Weighted residual factors for significantly intense reflections | 0.1252 |
Weighted residual factors for all reflections included in the refinement | 0.1458 |
Goodness-of-fit parameter for all reflections included in the refinement | 1.015 |
Diffraction radiation probe | x-ray |
Diffraction radiation wavelength | 1.54184 Å |
Diffraction radiation type | CuKα |