Information card for entry 7700763
Formula | C72 H59 Ag N O19 P Ti4 |
Calculated formula | C72 H59 Ag N O19 P Ti4 |
Title of publication | A series of silver doped butterfly-like Ti<sub>8</sub>Ag<sub>2</sub> clusters with two Ag ions panelled on a Ti<sub>8</sub> surface. |
Authors of publication | Yu, You-Zhu; Guo, Yao; Zhang, Yan-Ru; Liu, Min-Min; Feng, Ya-Ru; Geng, Cui-Huan; Zhang, Xian-Ming |
Journal of publication | Dalton transactions (Cambridge, England : 2003) |
Year of publication | 2019 |
Journal volume | 48 |
Journal issue | 35 |
Pages of publication | 13423 - 13429 |
a | 14.1578 ± 0.0002 Å |
b | 15.25 ± 0.0002 Å |
c | 17.4641 ± 0.0003 Å |
α | 88.552 ± 0.001° |
β | 67.58 ± 0.001° |
γ | 79.147 ± 0.001° |
Cell volume | 3418.76 ± 0.09 Å3 |
Cell temperature | 170 ± 2 K |
Ambient diffraction temperature | 170 ± 2 K |
Number of distinct elements | 7 |
Space group number | 2 |
Hermann-Mauguin space group symbol | P -1 |
Hall space group symbol | -P 1 |
Residual factor for all reflections | 0.0703 |
Residual factor for significantly intense reflections | 0.0556 |
Weighted residual factors for significantly intense reflections | 0.125 |
Weighted residual factors for all reflections included in the refinement | 0.1405 |
Goodness-of-fit parameter for all reflections included in the refinement | 1.021 |
Diffraction radiation wavelength | 0.71073 Å |
Diffraction radiation type | MoKα |