Information card for entry 7700764
Formula | C198 H224 Ag2 N4 O38 P2 Ti8 |
Calculated formula | C198 H224 Ag2 N4 O38 P2 Ti8 |
Title of publication | A series of silver doped butterfly-like Ti<sub>8</sub>Ag<sub>2</sub> clusters with two Ag ions panelled on a Ti<sub>8</sub> surface. |
Authors of publication | Yu, You-Zhu; Guo, Yao; Zhang, Yan-Ru; Liu, Min-Min; Feng, Ya-Ru; Geng, Cui-Huan; Zhang, Xian-Ming |
Journal of publication | Dalton transactions (Cambridge, England : 2003) |
Year of publication | 2019 |
Journal volume | 48 |
Journal issue | 35 |
Pages of publication | 13423 - 13429 |
a | 16.6988 ± 0.0003 Å |
b | 18.6668 ± 0.0003 Å |
c | 19.6322 ± 0.0003 Å |
α | 107.806 ± 0.001° |
β | 112.285 ± 0.001° |
γ | 104.13 ± 0.001° |
Cell volume | 4920.39 ± 0.17 Å3 |
Cell temperature | 170 ± 2 K |
Ambient diffraction temperature | 170 ± 2 K |
Number of distinct elements | 7 |
Space group number | 2 |
Hermann-Mauguin space group symbol | P -1 |
Hall space group symbol | -P 1 |
Residual factor for all reflections | 0.0504 |
Residual factor for significantly intense reflections | 0.0439 |
Weighted residual factors for significantly intense reflections | 0.112 |
Weighted residual factors for all reflections included in the refinement | 0.1183 |
Goodness-of-fit parameter for all reflections included in the refinement | 1.026 |
Diffraction radiation wavelength | 0.71073 Å |
Diffraction radiation type | MoKα |