Information card for entry 7700782
Formula | C31 H18 B F9 N2 |
Calculated formula | C31 H18 B F9 N2 |
Title of publication | Reactions of hydrazones and hydrazides with Lewis acidic boranes. |
Authors of publication | Gazis, Theodore A.; Dasgupta, Ayan; Hill, Michael S.; Rawson, Jeremy M.; Wirth, Thomas; Melen, Rebecca L. |
Journal of publication | Dalton transactions (Cambridge, England : 2003) |
Year of publication | 2019 |
Journal volume | 48 |
Journal issue | 33 |
Pages of publication | 12391 - 12395 |
a | 9.7975 ± 0.0007 Å |
b | 10.9639 ± 0.0011 Å |
c | 13.8619 ± 0.0015 Å |
α | 106.193 ± 0.009° |
β | 102.43 ± 0.007° |
γ | 105.643 ± 0.007° |
Cell volume | 1307.3 ± 0.2 Å3 |
Cell temperature | 150 ± 2 K |
Ambient diffraction temperature | 150 ± 2 K |
Number of distinct elements | 5 |
Space group number | 2 |
Hermann-Mauguin space group symbol | P -1 |
Hall space group symbol | -P 1 |
Residual factor for all reflections | 0.0941 |
Residual factor for significantly intense reflections | 0.0557 |
Weighted residual factors for significantly intense reflections | 0.1173 |
Weighted residual factors for all reflections included in the refinement | 0.1486 |
Goodness-of-fit parameter for all reflections included in the refinement | 1.083 |
Diffraction radiation wavelength | 0.71073 Å |
Diffraction radiation type | MoKα |